Reaction Details
TargetPlatelet-derived growth factor receptor beta
LigandBDBM50362065
Substrate/Competitorn/a
Meas. Tech.ChEMBL_797353 (CHEMBL1942929)
IC50 0.300000±n/a nM
Citation Plé, PAJung, FAshton, SHennequin, LLaine, RMorgentin, RPasquet, GTaylor, S Discovery of AZD2932, a new Quinazoline Ether Inhibitor with high affinity for VEGFR-2 and PDGFR tyrosine kinases. Bioorg Med Chem Lett22:262-6 (2011) 
 
Platelet-derived growth factor receptor beta
Name:Platelet-derived growth factor receptor beta
Type:Enzyme
Mol. Mass.:123922.25
Organism:Homo sapiens (Human)
Description:P09619
Residue:1106
BDBM50362065
NameBDBM50362065
Synonyms:CHEMBL1940109
TypeSmall organic molecule
Emp. Form.C24H25N5O6
Mol. Mass.479.4852
SMILESCOCCOc1cc2ncnc(Oc3cnn(CC(=O)Nc4cccc(OC)c4)c3)c2cc1OC