Reaction Details
TargetPlatelet-derived growth factor receptor beta
LigandBDBM50362070
Substrate/Competitorn/a
Meas. Tech.ChEMBL_797353 (CHEMBL1942929)
IC50 2±n/a nM
Citation Plé, PAJung, FAshton, SHennequin, LLaine, RMorgentin, RPasquet, GTaylor, S Discovery of AZD2932, a new Quinazoline Ether Inhibitor with high affinity for VEGFR-2 and PDGFR tyrosine kinases. Bioorg Med Chem Lett22:262-6 (2011) 
 
Platelet-derived growth factor receptor beta
Name:Platelet-derived growth factor receptor beta
Type:Enzyme
Mol. Mass.:123922.25
Organism:Homo sapiens (Human)
Description:P09619
Residue:1106
BDBM50362070
NameBDBM50362070
Synonyms:CHEMBL1940114
TypeSmall organic molecule
Emp. Form.C23H19N5O4
Mol. Mass.429.4281
SMILESCOc1cccc(NC(=O)Cn2cc(Oc3ccnc4cc(OC)c(cc34)C#N)cn2)c1