Reaction Details
TargetPlatelet-derived growth factor receptor beta
LigandBDBM50362073
Substrate/Competitorn/a
Meas. Tech.ChEMBL_797353 (CHEMBL1942929)
IC50>1000±n/a nM
Citation Plé, PAJung, FAshton, SHennequin, LLaine, RMorgentin, RPasquet, GTaylor, S Discovery of AZD2932, a new Quinazoline Ether Inhibitor with high affinity for VEGFR-2 and PDGFR tyrosine kinases. Bioorg Med Chem Lett22:262-6 (2011) 
 
Platelet-derived growth factor receptor beta
Name:Platelet-derived growth factor receptor beta
Type:Enzyme
Mol. Mass.:123922.25
Organism:Homo sapiens (Human)
Description:P09619
Residue:1106
BDBM50362073
NameBDBM50362073
Synonyms:CHEMBL1940117
TypeSmall organic molecule
Emp. Form.C21H22N6O4
Mol. Mass.422.4372
SMILESCCn1cc(NC(=O)Cc2cc(Oc3ccnc4cc(OC)c(OC)cc34)[nH]n2)cn1