Reaction Details
TargetPlatelet-derived growth factor receptor beta
LigandBDBM50362083
Substrate/Competitorn/a
Meas. Tech.ChEMBL_797353 (CHEMBL1942929)
IC50 20±n/a nM
Citation Plé, PAJung, FAshton, SHennequin, LLaine, RMorgentin, RPasquet, GTaylor, S Discovery of AZD2932, a new Quinazoline Ether Inhibitor with high affinity for VEGFR-2 and PDGFR tyrosine kinases. Bioorg Med Chem Lett22:262-6 (2011) 
 
Platelet-derived growth factor receptor beta
Name:Platelet-derived growth factor receptor beta
Type:Enzyme
Mol. Mass.:123922.25
Organism:Homo sapiens (Human)
Description:P09619
Residue:1106
BDBM50362083
NameBDBM50362083
Synonyms:CHEMBL1940267
TypeSmall organic molecule
Emp. Form.C24H22N2O5
Mol. Mass.418.4419
SMILESCOc1cccc(COc2ccc(Oc3ncnc4cc(OC)c(OC)cc34)cc2)c1