Reaction Details
TargetMacrophage colony-stimulating factor 1 receptor
LigandBDBM50362063
Substrate/Competitorn/a
Meas. Tech.ChEMBL_797355 (CHEMBL1942931)
IC50 20±n/a nM
Citation Plé, PAJung, FAshton, SHennequin, LLaine, RMorgentin, RPasquet, GTaylor, S Discovery of AZD2932, a new Quinazoline Ether Inhibitor with high affinity for VEGFR-2 and PDGFR tyrosine kinases. Bioorg Med Chem Lett22:262-6 (2011) 
 
Macrophage colony-stimulating factor 1 receptor
Name:Macrophage colony-stimulating factor 1 receptor
Type:Protein
Mol. Mass.:107979.48
Organism:Homo sapiens (Human)
Description:P07333
Residue:972
BDBM50362063
NameBDBM50362063
Synonyms:CHEMBL1940107
TypeSmall organic molecule
Emp. Form.C22H23N7O4
Mol. Mass.449.4625
SMILESCOc1cc2ncnc(Oc3cnn(CC(=O)Nc4ccc(cn4)N(C)C)c3)c2cc1OC