Reaction Details
TargetMacrophage colony-stimulating factor 1 receptor
LigandBDBM50362074
Substrate/Competitorn/a
Meas. Tech.ChEMBL_797355 (CHEMBL1942931)
IC50 600±n/a nM
Citation Plé, PAJung, FAshton, SHennequin, LLaine, RMorgentin, RPasquet, GTaylor, S Discovery of AZD2932, a new Quinazoline Ether Inhibitor with high affinity for VEGFR-2 and PDGFR tyrosine kinases. Bioorg Med Chem Lett22:262-6 (2011) 
 
Macrophage colony-stimulating factor 1 receptor
Name:Macrophage colony-stimulating factor 1 receptor
Type:Protein
Mol. Mass.:107979.48
Organism:Homo sapiens (Human)
Description:P07333
Residue:972
BDBM50362074
NameBDBM50362074
Synonyms:CHEMBL1940118
TypeSmall organic molecule
Emp. Form.C25H25N5O4
Mol. Mass.459.4971
SMILESCOc1cc2ncnc(Oc3ccc(CC(=O)Nc4ccc(cn4)N(C)C)cc3)c2cc1OC