Reaction Details
TargetReceptor-type tyrosine-protein kinase FLT3
LigandBDBM50362087
Substrate/Competitorn/a
Meas. Tech.ChEMBL_797357 (CHEMBL1942933)
IC50 80±n/a nM
Citation Plé, PAJung, FAshton, SHennequin, LLaine, RMorgentin, RPasquet, GTaylor, S Discovery of AZD2932, a new Quinazoline Ether Inhibitor with high affinity for VEGFR-2 and PDGFR tyrosine kinases. Bioorg Med Chem Lett22:262-6 (2011) 
 
Receptor-type tyrosine-protein kinase FLT3
Name:Receptor-type tyrosine-protein kinase FLT3
Type:Enzyme
Mol. Mass.:112888.62
Organism:Homo sapiens (Human)
Description:P36888
Residue:993
BDBM50362087
NameBDBM50362087
Synonyms:CHEMBL1940271
TypeSmall organic molecule
Emp. Form.C22H21N5O4
Mol. Mass.419.4332
SMILESCOc1cc2ncnc(Oc3ccc(CC(=O)Nc4cnn(C)c4)cc3)c2cc1OC