Reaction Details
TargetReceptor-type tyrosine-protein kinase FLT3
LigandBDBM50362062
Substrate/Competitorn/a
Meas. Tech.ChEMBL_797357 (CHEMBL1942933)
IC50 10±n/a nM
Citation Plé, PAJung, FAshton, SHennequin, LLaine, RMorgentin, RPasquet, GTaylor, S Discovery of AZD2932, a new Quinazoline Ether Inhibitor with high affinity for VEGFR-2 and PDGFR tyrosine kinases. Bioorg Med Chem Lett22:262-6 (2011) 
 
Receptor-type tyrosine-protein kinase FLT3
Name:Receptor-type tyrosine-protein kinase FLT3
Type:Enzyme
Mol. Mass.:112888.62
Organism:Homo sapiens (Human)
Description:P36888
Residue:993
BDBM50362062
NameBDBM50362062
Synonyms:CHEMBL1940106
TypeSmall organic molecule
Emp. Form.C22H24N8O3
Mol. Mass.448.4778
SMILESCOc1cc2ncnc(Nc3cnn(CC(=O)Nc4ccc(cn4)N(C)C)c3)c2cc1OC