Reaction Details
TargetReceptor-type tyrosine-protein kinase FLT3
LigandBDBM50362078
Substrate/Competitorn/a
Meas. Tech.ChEMBL_797357 (CHEMBL1942933)
IC50 8±n/a nM
Citation Plé, PAJung, FAshton, SHennequin, LLaine, RMorgentin, RPasquet, GTaylor, S Discovery of AZD2932, a new Quinazoline Ether Inhibitor with high affinity for VEGFR-2 and PDGFR tyrosine kinases. Bioorg Med Chem Lett22:262-6 (2011) 
 
Receptor-type tyrosine-protein kinase FLT3
Name:Receptor-type tyrosine-protein kinase FLT3
Type:Enzyme
Mol. Mass.:112888.62
Organism:Homo sapiens (Human)
Description:P36888
Residue:993
BDBM50362078
NameBDBM50362078
Synonyms:CHEMBL1940262
TypeSmall organic molecule
Emp. Form.C25H24N4O5
Mol. Mass.460.4819
SMILESCOc1cccc(NC(=O)NCc2ccc(Oc3ncnc4cc(OC)c(OC)cc34)cc2)c1