Reaction Details
TargetCollagenase 3
LigandBDBM50026697
Substrate/Competitorn/a
Meas. Tech.ChEMBL_798828 (CHEMBL1943704)
IC50 10±n/a nM
Citation De Savi, CMorley, ADNash, IKaroutchi, GPage, KTing, AGerhardt, S Lead optimisation of selective non-zinc binding inhibitors of MMP13. Part 2. Bioorg Med Chem Lett22:271-7 (2011) 
 
Collagenase 3
Name:Collagenase 3
Type:Enzyme
Mol. Mass.:53808.06
Organism:Homo sapiens (Human)
Description:P45452
Residue:471
BDBM50026697
NameBDBM50026697
Synonyms:CHEMBL1940287
TypeSmall organic molecule
Emp. Form.C31H32N2O5
Mol. Mass.512.5962
SMILESCOc1ccc(CNC(=O)c2ccc(Oc3ccc(cc3)C#C[C@]3(O)CN4CCC3CC4)cc2)cc1OC