Reaction Details
TargetMatrix metalloproteinase-19
LigandBDBM50362091
Substrate/Competitorn/a
Meas. Tech.ChEMBL_797393 (CHEMBL1943056)
IC50>10000±n/a nM
Citation De Savi, CMorley, ADNash, IKaroutchi, GPage, KTing, AGerhardt, S Lead optimisation of selective non-zinc binding inhibitors of MMP13. Part 2. Bioorg Med Chem Lett22:271-7 (2011) 
 
Matrix metalloproteinase-19
Name:Matrix metalloproteinase-19
Type:PROTEIN
Mol. Mass.:57362.84
Organism:Homo sapiens (Human)
Description:ChEMBL_797393
Residue:508
BDBM50362091
NameBDBM50362091
Synonyms:CHEMBL1940315
TypeSmall organic molecule
Emp. Form.C27H30N2O5S
Mol. Mass.494.603
SMILESO[C@]1(CN2CCC1CC2)C#Cc1ccc(Oc2ccc(cc2)C(=O)NC2CCCS(=O)(=O)C2)cc1