Reaction Details
TargetApoptosis regulator Bcl-2
LigandBDBM50362141
Substrate/Competitorn/a
Meas. Tech.ChEMBL_797476 (CHEMBL1943219)
Ki 800±n/a nM
Citation Zheng, CHYang, HZhang, MLu, SHShi, DWang, JChen, XHRen, XHLiu, JLv, JGZhu, JZhou, YJ Design, synthesis, and activity evaluation of broad-spectrum small-molecule inhibitors of anti-apoptotic Bcl-2 family proteins: characteristics of broad-spectrum protein binding and its effects on anti-tumor activity. Bioorg Med Chem Lett22:39-44 (2011) 
 
Apoptosis regulator Bcl-2
Name:Apoptosis regulator Bcl-2
Type:Homodimer or heterodimer
Mol. Mass.:26269.11
Organism:Homo sapiens (Human)
Description:P10415
Residue:239
BDBM50362141
NameBDBM50362141
Synonyms:CHEMBL1940679
TypeSmall organic molecule
Emp. Form.C29H26N4O7S2
Mol. Mass.606.669
SMILESCOc1ccc(cc1)C(=O)Nc1ccc(cc1)C(=O)NS(=O)(=O)c1ccc(NCCSc2ccccc2)c(c1)[N+]([O-])=O