Reaction Details
TargetProstaglandin D2 receptor 2
LigandBDBM50362159
Substrate/Competitorn/a
Meas. Tech.ChEMBL_797666 (CHEMBL1943886)
IC50 6.2±n/a nM
Citation Ito, STerasaka, TZenkoh, TMatsuda, HHayashida, HNagata, HImamura, YKobayashi, MTakeuchi, MOhta, M Discovery of novel and potent CRTH2 antagonists. Bioorg Med Chem Lett22:1194-7 (2012) 
 
Prostaglandin D2 receptor 2
Name:Prostaglandin D2 receptor 2
Type:Enzyme
Mol. Mass.:43295.45
Organism:Homo sapiens (Human)
Description:Q9Y5Y4
Residue:395
BDBM50362159
NameBDBM50362159
Synonyms:CHEMBL1941120
TypeSmall organic molecule
Emp. Form.C31H31NO4
Mol. Mass.481.5821
SMILESCc1ccc(cc1)C(c1ccc(C)cc1)c1ccc(=O)n(CCCc2cccc(OCC(O)=O)c2)c1