Reaction Details
TargetProstaglandin D2 receptor 2
LigandBDBM50362158
Substrate/Competitorn/a
Meas. Tech.ChEMBL_797760 (CHEMBL1944119)
IC50>1000±n/a nM
Citation Ito, STerasaka, TZenkoh, TMatsuda, HHayashida, HNagata, HImamura, YKobayashi, MTakeuchi, MOhta, M Discovery of novel and potent CRTH2 antagonists. Bioorg Med Chem Lett22:1194-7 (2012) 
 
Prostaglandin D2 receptor 2
Name:Prostaglandin D2 receptor 2
Synonyms:Chemoattractant receptor-homologous molecule expressed on Th2 cells
Type:PROTEIN
Mol. Mass.:42241.65
Organism:Cavia porcellus
Description:ChEMBL_797760
Residue:391
BDBM50362158
NameBDBM50362158
Synonyms:CHEMBL1941119
TypeSmall organic molecule
Emp. Form.C29H25Cl2NO4
Mol. Mass.522.419
SMILESOC(=O)COc1cccc(CCCn2cc(ccc2=O)C(c2ccc(Cl)cc2)c2ccc(Cl)cc2)c1