Reaction Details
TargetProstaglandin D2 receptor 2
LigandBDBM50362161
Substrate/Competitorn/a
Meas. Tech.ChEMBL_797760 (CHEMBL1944119)
IC50 797±n/a nM
Citation Ito, STerasaka, TZenkoh, TMatsuda, HHayashida, HNagata, HImamura, YKobayashi, MTakeuchi, MOhta, M Discovery of novel and potent CRTH2 antagonists. Bioorg Med Chem Lett22:1194-7 (2012) 
 
Prostaglandin D2 receptor 2
Name:Prostaglandin D2 receptor 2
Synonyms:Chemoattractant receptor-homologous molecule expressed on Th2 cells
Type:PROTEIN
Mol. Mass.:42241.65
Organism:Cavia porcellus
Description:ChEMBL_797760
Residue:391
BDBM50362161
NameBDBM50362161
Synonyms:CHEMBL1941122
TypeSmall organic molecule
Emp. Form.C28H25NO5
Mol. Mass.455.5018
SMILESOC(=O)COc1cccc(OCCn2cc(ccc2=O)C(c2ccccc2)c2ccccc2)c1