Reaction Details
TargetMAP kinase-activated protein kinase 2
LigandBDBM50362175
Substrate/Competitorn/a
Meas. Tech.ChEMBL_797937 (CHEMBL1942718)
IC50 3.8±n/a nM
Citation Rao, AUXiao, DHuang, XZhou, WFossetta, JLundell, DTian, FTrivedi, PAslanian, RPalani, A Facile synthesis of tetracyclic azepine and oxazocine derivatives and their potential as MAPKAP-K2 (MK2) inhibitors. Bioorg Med Chem Lett22:1068-72 (2012) 
 
MAP kinase-activated protein kinase 2
Name:MAP kinase-activated protein kinase 2
Type:Serine/threonine-protein kinase
Mol. Mass.:45579.87
Organism:Homo sapiens (Human)
Description:P49137
Residue:400
BDBM50362175
NameBDBM50362175
Synonyms:CHEMBL1938687
TypeSmall organic molecule
Emp. Form.C24H20N6O
Mol. Mass.408.4552
SMILESN#Cc1ccc(cc1)-c1cc2Cc3cc(ccc3-n3cnnc3-c2o1)N1CCNCC1