Reaction Details
TargetHistamine H4 receptor
LigandBDBM50362214
Substrate/Competitorn/a
Meas. Tech.ChEMBL_798256 (CHEMBL1943643)
Ki 4.6±n/a nM
Citation Lane, CAHay, DMowbray, CEParadowski, MSelby, MDSwain, NAWilliams, DH Synthesis of novel histamine H4 receptor antagonists. Bioorg Med Chem Lett22:1156-9 (2012) 
 
Histamine H4 receptor
Name:Histamine H4 receptor
Type:G Protein-Coupled Receptor (GPCR)
Mol. Mass.:44517.02
Organism:Homo sapiens (Human)
Description:Binding assays were using CHO cells stably expressing hH4R receptors.
Residue:390
BDBM50362214
NameBDBM50362214
Synonyms:CHEMBL1938975
TypeSmall organic molecule
Emp. Form.C16H20FN5
Mol. Mass.301.3619
SMILESCN1C[C@H]2CN(C[C@H]2C1)C(=N)c1nc2ccc(F)c(C)c2[nH]1