Reaction Details
TargetHistamine H4 receptor
LigandBDBM50362218
Substrate/Competitorn/a
Meas. Tech.ChEMBL_798256 (CHEMBL1943643)
Ki 6.5±n/a nM
Citation Lane, CAHay, DMowbray, CEParadowski, MSelby, MDSwain, NAWilliams, DH Synthesis of novel histamine H4 receptor antagonists. Bioorg Med Chem Lett22:1156-9 (2012) 
 
Histamine H4 receptor
Name:Histamine H4 receptor
Type:G Protein-Coupled Receptor (GPCR)
Mol. Mass.:44517.02
Organism:Homo sapiens (Human)
Description:Binding assays were using CHO cells stably expressing hH4R receptors.
Residue:390
BDBM50362218
NameBDBM50362218
Synonyms:CHEMBL1938979
TypeSmall organic molecule
Emp. Form.C15H19N5
Mol. Mass.269.3449
SMILESCN1C[C@H]2CN(C[C@H]2C1)C(=N)c1nc2ccccc2[nH]1