Reaction Details
TargetHistamine H4 receptor
LigandBDBM22566
Substrate/Competitorn/a
Meas. Tech.ChEMBL_798257 (CHEMBL1943644)
Ki 6.8±n/a nM
Citation Lane, CAHay, DMowbray, CEParadowski, MSelby, MDSwain, NAWilliams, DH Synthesis of novel histamine H4 receptor antagonists. Bioorg Med Chem Lett22:1156-9 (2012) 
 
Histamine H4 receptor
Name:Histamine H4 receptor
Type:G Protein-Coupled Receptor (GPCR)
Mol. Mass.:44517.02
Organism:Homo sapiens (Human)
Description:Binding assays were using CHO cells stably expressing hH4R receptors.
Residue:390
BDBM22566
NameBDBM22566
Synonyms:5-chloro-2-[(4-methylpiperazin-1-yl)carbonyl]-1H-indole JNJ 7777120
TypeSmall organic molecule
Emp. Form.C14H16ClN3O
Mol. Mass.277.749
SMILESCN1CCN(CC1)C(=O)c1cc2cc(Cl)ccc2[nH]1