Reaction Details
TargetHistamine H4 receptor
LigandBDBM50362204
Substrate/Competitorn/a
Meas. Tech.ChEMBL_798257 (CHEMBL1943644)
Ki 97±n/a nM
Citation Lane, CAHay, DMowbray, CEParadowski, MSelby, MDSwain, NAWilliams, DH Synthesis of novel histamine H4 receptor antagonists. Bioorg Med Chem Lett22:1156-9 (2012) 
 
Histamine H4 receptor
Name:Histamine H4 receptor
Type:G Protein-Coupled Receptor (GPCR)
Mol. Mass.:44517.02
Organism:Homo sapiens (Human)
Description:Binding assays were using CHO cells stably expressing hH4R receptors.
Residue:390
BDBM50362204
NameBDBM50362204
Synonyms:CHEMBL1938845
TypeSmall organic molecule
Emp. Form.C16H19FN4O
Mol. Mass.302.3467
SMILESCN1C[C@H]2CN(C[C@H]2C1)C(=O)c1nc2ccc(F)c(C)c2[nH]1