Reaction Details
TargetHeat shock protein HSP 90-alpha
LigandBDBM50362225
Substrate/Competitorn/a
Meas. Tech.ChEMBL_798461 (CHEMBL1944310)
Kd 0.25±n/a nM
Citation Suda, AKoyano, HHayase, THada, KKawasaki, KKomiyama, SHasegawa, KFukami, TASato, SMiura, TOno, NYamazaki, TSaitoh, RShimma, NShiratori, YTsukuda, T Design and synthesis of novel macrocyclic 2-amino-6-arylpyrimidine Hsp90 inhibitors. Bioorg Med Chem Lett22:1136-41 (2012) 
 
Heat shock protein HSP 90-alpha
Name:Heat shock protein HSP 90-alpha
Type:Molecular Chaperone
Mol. Mass.:84623.45
Organism:Homo sapiens (Human)
Description:P07900
Residue:732
BDBM50362225
NameBDBM50362225
Synonyms:CHEMBL1939381
TypeSmall organic molecule
Emp. Form.C21H27N5O2S
Mol. Mass.413.536
SMILESCc1cc(C)c2cc1-c1cc(SCCC(=O)NCCCCCNC2=O)nc(N)n1