Reaction Details
TargetHeat shock protein HSP 90-alpha
LigandBDBM50362227
Substrate/Competitorn/a
Meas. Tech.ChEMBL_798461 (CHEMBL1944310)
Kd 10±n/a nM
Citation Suda, AKoyano, HHayase, THada, KKawasaki, KKomiyama, SHasegawa, KFukami, TASato, SMiura, TOno, NYamazaki, TSaitoh, RShimma, NShiratori, YTsukuda, T Design and synthesis of novel macrocyclic 2-amino-6-arylpyrimidine Hsp90 inhibitors. Bioorg Med Chem Lett22:1136-41 (2012) 
 
Heat shock protein HSP 90-alpha
Name:Heat shock protein HSP 90-alpha
Type:Molecular Chaperone
Mol. Mass.:84623.45
Organism:Homo sapiens (Human)
Description:P07900
Residue:732
BDBM50362227
NameBDBM50362227
Synonyms:CHEMBL1939378
TypeSmall organic molecule
Emp. Form.C23H24N4O3S
Mol. Mass.436.527
SMILESCCOc1cc(C)c-2cc1C(=O)NCCCOc1cccc(Sc3cc-2nc(N)n3)c1