Reaction Details
TargetCorticotropin-releasing factor receptor 1
LigandBDBM50362260
Substrate/Competitorn/a
Meas. Tech.ChEMBL_798647 (CHEMBL1942636)
IC50 3.8±n/a nM
Citation Saito, TObitsu, TKohno, HSugimoto, IMatsushita, TNishiyama, THirota, TTakeda, HMatsumura, NUeno, SKishi, AKagamiishi, YNakai, HTakaoka, Y Pyrrolo[1,2-b]pyridazines, pyrrolo[2,1-f]triazin-4(3H)-ones, and related compounds as novel corticotropin-releasing factor 1 (CRF¿?) receptor antagonists. Bioorg Med Chem20:1122-38 (2012) 
 
Corticotropin-releasing factor receptor 1
Name:Corticotropin-releasing factor receptor 1
Type:Enzyme
Mol. Mass.:50744.31
Organism:Homo sapiens (Human)
Description:P34998
Residue:444
BDBM50362260
NameBDBM50362260
Synonyms:CHEMBL1939571
TypeSmall organic molecule
Emp. Form.C20H24ClN3O2
Mol. Mass.373.876
SMILESCCC(CC)c1cc(C)n2nc(-c3ccc(OC)cc3Cl)n(C)c(=O)c12