Reaction Details
TargetCorticotropin-releasing factor receptor 1
LigandBDBM50362278
Substrate/Competitorn/a
Meas. Tech.ChEMBL_798647 (CHEMBL1942636)
IC50 13.1±n/a nM
Citation Saito, TObitsu, TKohno, HSugimoto, IMatsushita, TNishiyama, THirota, TTakeda, HMatsumura, NUeno, SKishi, AKagamiishi, YNakai, HTakaoka, Y Pyrrolo[1,2-b]pyridazines, pyrrolo[2,1-f]triazin-4(3H)-ones, and related compounds as novel corticotropin-releasing factor 1 (CRF¿?) receptor antagonists. Bioorg Med Chem20:1122-38 (2012) 
 
Corticotropin-releasing factor receptor 1
Name:Corticotropin-releasing factor receptor 1
Type:Enzyme
Mol. Mass.:50744.31
Organism:Homo sapiens (Human)
Description:P34998
Residue:444
BDBM50362278
NameBDBM50362278
Synonyms:CHEMBL1939602
TypeSmall organic molecule
Emp. Form.C20H25N3O2
Mol. Mass.339.4314
SMILESCOc1cc(C)c(c(C)c1)-c1nn2c(C)cc(C(C)C)c2c(=O)n1C