Reaction Details
TargetCorticotropin-releasing factor receptor 1
LigandBDBM50362280
Substrate/Competitorn/a
Meas. Tech.ChEMBL_798648 (CHEMBL1942637)
IC50 8.4±n/a nM
Citation Saito, TObitsu, TKohno, HSugimoto, IMatsushita, TNishiyama, THirota, TTakeda, HMatsumura, NUeno, SKishi, AKagamiishi, YNakai, HTakaoka, Y Pyrrolo[1,2-b]pyridazines, pyrrolo[2,1-f]triazin-4(3H)-ones, and related compounds as novel corticotropin-releasing factor 1 (CRF¿?) receptor antagonists. Bioorg Med Chem20:1122-38 (2012) 
 
Corticotropin-releasing factor receptor 1
Name:Corticotropin-releasing factor receptor 1
Type:G Protein-Coupled Receptor (GPCR)
Mol. Mass.:47870.75
Organism:Rattus norvegicus (rat)
Description:Receptor binding assays were performed using rat cortex homogenate.
Residue:415
BDBM50362280
NameBDBM50362280
Synonyms:CHEMBL1939592
TypeSmall organic molecule
Emp. Form.C20H24F2N4O2
Mol. Mass.390.427
SMILESCCC(CC)c1cc(C)n2nc(-c3cnc(OC(F)F)cc3C)n(C)c(=O)c12