Reaction Details
TargetDelta-type opioid receptor
LigandBDBM50362303
Substrate/Competitorn/a
Meas. Tech.ChEMBL_797688 (CHEMBL1943908)
IC50 1.3±n/a nM
Citation McCauley, JPDantzman, CLKing, MMErnst, GEWang, XBrush, KPalmer, WEFrietze, WAndisik, DWHoesch, VDoring, KHulsizer, JBui, KHLiu, JHudzik, TJWesolowski, SS Multiparameter exploration of piperazine derivatives asd-opioid receptor agonists for CNS indications. Bioorg Med Chem Lett22:1169-73 (2012) 
 
Delta-type opioid receptor
Name:Delta-type opioid receptor
Type:G Protein-Coupled Receptor (GPCR)
Mol. Mass.:40382.98
Organism:Homo sapiens (Human)
Description:Competition binding assays were carried out using membrane preparations from transfected HN9.10 cells that constitutively expressed the delta opioid receptor.
Residue:372
BDBM50362303
NameBDBM50362303
Synonyms:CHEMBL1939747
TypeSmall organic molecule
Emp. Form.C29H37N5O3S
Mol. Mass.535.701
SMILESCCOC(=O)Nc1ccc(cc1)[C@H](N1CCN(Cc2cscn2)CC1)c1ccc(cc1)C(=O)N(CC)CC