Reaction Details
TargetDelta-type opioid receptor
LigandBDBM50362301
Substrate/Competitorn/a
Meas. Tech.ChEMBL_797688 (CHEMBL1943908)
IC50 0.260000±n/a nM
Citation McCauley, JPDantzman, CLKing, MMErnst, GEWang, XBrush, KPalmer, WEFrietze, WAndisik, DWHoesch, VDoring, KHulsizer, JBui, KHLiu, JHudzik, TJWesolowski, SS Multiparameter exploration of piperazine derivatives asd-opioid receptor agonists for CNS indications. Bioorg Med Chem Lett22:1169-73 (2012) 
 
Delta-type opioid receptor
Name:Delta-type opioid receptor
Type:G Protein-Coupled Receptor (GPCR)
Mol. Mass.:40382.98
Organism:Homo sapiens (Human)
Description:Competition binding assays were carried out using membrane preparations from transfected HN9.10 cells that constitutively expressed the delta opioid receptor.
Residue:372
BDBM50362301
NameBDBM50362301
Synonyms:CHEMBL1939749
TypeSmall organic molecule
Emp. Form.C29H38N6O3
Mol. Mass.518.6504
SMILESCCOC(=O)Nc1cccc(c1)[C@H](N1CCN(Cc2[nH]cnc2C)CC1)c1ccc(cc1)C(=O)N(C)CC