Reaction Details
TargetB1 bradykinin receptor
LigandBDBM50362318
Substrate/Competitorn/a
Meas. Tech.ChEMBL_797692 (CHEMBL1943912)
IC50 38±n/a nM
Citation Qian, WChen, JJHuman, JAya, TZhu, JBiswas, KPeterkin, THungate, RWArik, LJohnson, EKumar, GJoseph, SJona, JGuo, HXWu, Z Discovery of dehydro-oxopiperazine acetamides as novel bradykinin B1 receptor antagonists with enhanced in vitro potency. Bioorg Med Chem Lett22:1061-7 (2012) 
 
B1 bradykinin receptor
Name:B1 bradykinin receptor
Type:Enzyme
Mol. Mass.:40508.87
Organism:Homo sapiens (Human)
Description:P46663
Residue:353
BDBM50362318
NameBDBM50362318
Synonyms:CHEMBL1939949
TypeSmall organic molecule
Emp. Form.C23H31ClN4O4S
Mol. Mass.495.035
SMILESCc1cc(c(C)cc1Cl)S(=O)(=O)N1C=CNC(=O)[C@H]1CC(=O)N1CCC[C@@H](C1)N1CCCC1