Reaction Details
TargetB1 bradykinin receptor
LigandBDBM50362323
Substrate/Competitorn/a
Meas. Tech.ChEMBL_797692 (CHEMBL1943912)
IC50 20.3±n/a nM
Citation Qian, WChen, JJHuman, JAya, TZhu, JBiswas, KPeterkin, THungate, RWArik, LJohnson, EKumar, GJoseph, SJona, JGuo, HXWu, Z Discovery of dehydro-oxopiperazine acetamides as novel bradykinin B1 receptor antagonists with enhanced in vitro potency. Bioorg Med Chem Lett22:1061-7 (2012) 
 
B1 bradykinin receptor
Name:B1 bradykinin receptor
Type:Enzyme
Mol. Mass.:40508.87
Organism:Homo sapiens (Human)
Description:P46663
Residue:353
BDBM50362323
NameBDBM50362323
Synonyms:CHEMBL1939945
TypeSmall organic molecule
Emp. Form.C18H22Cl2N4O4S
Mol. Mass.461.363
SMILESCN(C)[C@H]1CCN(C1)C(=O)C[C@H]1N(C=CNC1=O)S(=O)(=O)c1cccc(Cl)c1Cl