Reaction Details
TargetB1 bradykinin receptor
LigandBDBM50362327
Substrate/Competitorn/a
Meas. Tech.ChEMBL_797692 (CHEMBL1943912)
IC50 0.65±n/a nM
Citation Qian, WChen, JJHuman, JAya, TZhu, JBiswas, KPeterkin, THungate, RWArik, LJohnson, EKumar, GJoseph, SJona, JGuo, HXWu, Z Discovery of dehydro-oxopiperazine acetamides as novel bradykinin B1 receptor antagonists with enhanced in vitro potency. Bioorg Med Chem Lett22:1061-7 (2012) 
 
B1 bradykinin receptor
Name:B1 bradykinin receptor
Type:Enzyme
Mol. Mass.:40508.87
Organism:Homo sapiens (Human)
Description:P46663
Residue:353
BDBM50362327
NameBDBM50362327
Synonyms:CHEMBL1939940
TypeSmall organic molecule
Emp. Form.C19H24Cl2N4O4S
Mol. Mass.475.389
SMILESCC1(C)CNCC[C@@H]1NC(=O)C[C@H]1N(C=CNC1=O)S(=O)(=O)c1ccc(Cl)c(Cl)c1