Reaction Details
TargetB1 bradykinin receptor
LigandBDBM50362333
Substrate/Competitorn/a
Meas. Tech.ChEMBL_797692 (CHEMBL1943912)
IC50 0.86±n/a nM
Citation Qian, WChen, JJHuman, JAya, TZhu, JBiswas, KPeterkin, THungate, RWArik, LJohnson, EKumar, GJoseph, SJona, JGuo, HXWu, Z Discovery of dehydro-oxopiperazine acetamides as novel bradykinin B1 receptor antagonists with enhanced in vitro potency. Bioorg Med Chem Lett22:1061-7 (2012) 
 
B1 bradykinin receptor
Name:B1 bradykinin receptor
Type:Enzyme
Mol. Mass.:40508.87
Organism:Homo sapiens (Human)
Description:P46663
Residue:353
BDBM50362333
NameBDBM50362333
Synonyms:CHEMBL1939934
TypeSmall organic molecule
Emp. Form.C24H36N4O4S
Mol. Mass.476.632
SMILESCC(C)CN1CC[C@H](NC(=O)C[C@H]2N(C=CNC2=O)S(=O)(=O)c2ccc(C)cc2)C(C)(C)C1