Reaction Details
TargetB1 bradykinin receptor
LigandBDBM50362355
Substrate/Competitorn/a
Meas. Tech.ChEMBL_797692 (CHEMBL1943912)
IC50 36.1±n/a nM
Citation Qian, WChen, JJHuman, JAya, TZhu, JBiswas, KPeterkin, THungate, RWArik, LJohnson, EKumar, GJoseph, SJona, JGuo, HXWu, Z Discovery of dehydro-oxopiperazine acetamides as novel bradykinin B1 receptor antagonists with enhanced in vitro potency. Bioorg Med Chem Lett22:1061-7 (2012) 
 
B1 bradykinin receptor
Name:B1 bradykinin receptor
Type:Enzyme
Mol. Mass.:40508.87
Organism:Homo sapiens (Human)
Description:P46663
Residue:353
BDBM50362355
NameBDBM50362355
Synonyms:CHEMBL1939766
TypeSmall organic molecule
Emp. Form.C24H27N3O5S
Mol. Mass.469.553
SMILESCOc1cccc2C(CCCc12)NC(=O)C[C@H]1N(C=CNC1=O)S(=O)(=O)c1ccc(C)cc1