Reaction Details
TargetB1 bradykinin receptor
LigandBDBM50344115
Substrate/Competitorn/a
Meas. Tech.ChEMBL_797692 (CHEMBL1943912)
IC50 238±n/a nM
Citation Qian, WChen, JJHuman, JAya, TZhu, JBiswas, KPeterkin, THungate, RWArik, LJohnson, EKumar, GJoseph, SJona, JGuo, HXWu, Z Discovery of dehydro-oxopiperazine acetamides as novel bradykinin B1 receptor antagonists with enhanced in vitro potency. Bioorg Med Chem Lett22:1061-7 (2012) 
 
B1 bradykinin receptor
Name:B1 bradykinin receptor
Type:Enzyme
Mol. Mass.:40508.87
Organism:Homo sapiens (Human)
Description:P46663
Residue:353
BDBM50344115
NameBDBM50344115
Synonyms:CHEMBL1777973 | N-((R)-6-(aminomethyl)-1,2,3,4-tetrahydronaphthalen-1-yl)-2-((R)-3-oxo-1-tosylpiperazin-2-yl)acetamide
TypeSmall organic molecule
Emp. Form.C24H30N4O4S
Mol. Mass.470.584
SMILESCc1ccc(cc1)S(=O)(=O)N1CCNC(=O)[C@H]1CC(=O)N[C@@H]1CCCc2cc(CN)ccc12