Reaction Details
TargetB1 bradykinin receptor
LigandBDBM50362362
Substrate/Competitorn/a
Meas. Tech.ChEMBL_797691 (CHEMBL1943911)
Ki 0.56±n/a nM
Citation Qian, WChen, JJHuman, JAya, TZhu, JBiswas, KPeterkin, THungate, RWArik, LJohnson, EKumar, GJoseph, SJona, JGuo, HXWu, Z Discovery of dehydro-oxopiperazine acetamides as novel bradykinin B1 receptor antagonists with enhanced in vitro potency. Bioorg Med Chem Lett22:1061-7 (2012) 
 
B1 bradykinin receptor
Name:B1 bradykinin receptor
Type:Enzyme
Mol. Mass.:40508.87
Organism:Homo sapiens (Human)
Description:P46663
Residue:353
BDBM50362362
NameBDBM50362362
Synonyms:CHEMBL1939759
TypeSmall organic molecule
Emp. Form.C27H32N4O4S
Mol. Mass.508.632
SMILESCc1ccc(cc1)S(=O)(=O)N1C=CNC(=O)[C@H]1CC(=O)N[C@@H]1CCCc2cc(CNC3CC3)ccc12