Reaction Details
TargetB1 bradykinin receptor
LigandBDBM50362364
Substrate/Competitorn/a
Meas. Tech.ChEMBL_797691 (CHEMBL1943911)
Ki 1.25±n/a nM
Citation Qian, WChen, JJHuman, JAya, TZhu, JBiswas, KPeterkin, THungate, RWArik, LJohnson, EKumar, GJoseph, SJona, JGuo, HXWu, Z Discovery of dehydro-oxopiperazine acetamides as novel bradykinin B1 receptor antagonists with enhanced in vitro potency. Bioorg Med Chem Lett22:1061-7 (2012) 
 
B1 bradykinin receptor
Name:B1 bradykinin receptor
Type:Enzyme
Mol. Mass.:40508.87
Organism:Homo sapiens (Human)
Description:P46663
Residue:353
BDBM50362364
NameBDBM50362364
Synonyms:CHEMBL1939757
TypeSmall organic molecule
Emp. Form.C26H32N4O4S
Mol. Mass.496.622
SMILESCN(C)Cc1ccc2[C@@H](CCCc2c1)NC(=O)C[C@H]1N(C=CNC1=O)S(=O)(=O)c1ccc(C)cc1