Reaction Details
TargetMuscarinic acetylcholine receptor M1
LigandBDBM50362375
Substrate/Competitorn/a
Meas. Tech.ChEMBL_797803 (CHEMBL1944259)
IC50>10000±n/a nM
Citation Melancon, BJLamers, APBridges, TMSulikowski, GAUtley, TJSheffler, DJNoetzel, MJMorrison, RDScott Daniels, JNiswender, CMJones, CKConn, PJLindsley, CWWood, MR Development of a more highly selective M(1) antagonist from the continued optimization of the MLPCN Probe ML012. Bioorg Med Chem Lett22:1044-8 (2012) 
 
Muscarinic acetylcholine receptor M1
Name:Muscarinic acetylcholine receptor M1
Type:Protein
Mol. Mass.:51442.54
Organism:Homo sapiens (Human)
Description:P11229
Residue:460
BDBM50362375
NameBDBM50362375
Synonyms:CHEMBL1939960
TypeSmall organic molecule
Emp. Form.C19H22N6O3S2
Mol. Mass.446.546
SMILESCc1ccnc(c1)N1CCN(CC1)C(=O)CCNS(=O)(=O)c1cccc2nsnc12