Reaction Details
TargetMuscarinic acetylcholine receptor M1
LigandBDBM50362385
Substrate/Competitorn/a
Meas. Tech.ChEMBL_797803 (CHEMBL1944259)
IC50>10000±n/a nM
Citation Melancon, BJLamers, APBridges, TMSulikowski, GAUtley, TJSheffler, DJNoetzel, MJMorrison, RDScott Daniels, JNiswender, CMJones, CKConn, PJLindsley, CWWood, MR Development of a more highly selective M(1) antagonist from the continued optimization of the MLPCN Probe ML012. Bioorg Med Chem Lett22:1044-8 (2012) 
 
Muscarinic acetylcholine receptor M1
Name:Muscarinic acetylcholine receptor M1
Type:Protein
Mol. Mass.:51442.54
Organism:Homo sapiens (Human)
Description:P11229
Residue:460
BDBM50362385
NameBDBM50362385
Synonyms:CHEMBL1939970
TypeSmall organic molecule
Emp. Form.C19H21BrN6O4S
Mol. Mass.509.377
SMILESCc1ccc2nonc2c1S(=O)(=O)NCCC(=O)N1CCN(CC1)c1ccc(Br)cn1