Reaction Details
TargetMuscarinic acetylcholine receptor M1
LigandBDBM50362401
Substrate/Competitorn/a
Meas. Tech.ChEMBL_797803 (CHEMBL1944259)
IC50>10000±n/a nM
Citation Melancon, BJLamers, APBridges, TMSulikowski, GAUtley, TJSheffler, DJNoetzel, MJMorrison, RDScott Daniels, JNiswender, CMJones, CKConn, PJLindsley, CWWood, MR Development of a more highly selective M(1) antagonist from the continued optimization of the MLPCN Probe ML012. Bioorg Med Chem Lett22:1044-8 (2012) 
 
Muscarinic acetylcholine receptor M1
Name:Muscarinic acetylcholine receptor M1
Type:Protein
Mol. Mass.:51442.54
Organism:Homo sapiens (Human)
Description:P11229
Residue:460
BDBM50362401
NameBDBM50362401
Synonyms:CHEMBL1940132
TypeSmall organic molecule
Emp. Form.C18H22N6O2S2
Mol. Mass.418.536
SMILESO=S(=O)(NCCCN1CCN(CC1)c1ccncc1)c1cccc2nsnc12