Reaction Details
TargetKappa-type opioid receptor
LigandBDBM50362539
Substrate/Competitorn/a
Meas. Tech.ChEMBL_797873 (CHEMBL1942560)
Ki 4.4±n/a nM
Citation Béguin, CPotuzak, JXu, WLiu-Chen, LYStreicher, JMGroer, CEBohn, LMCarlezon, WACohen, BM Differential signaling properties at the kappa opioid receptor of 12-epi-salvinorin A and its analogues. Bioorg Med Chem Lett22:1023-6 (2012) 
 
Kappa-type opioid receptor
Name:Kappa-type opioid receptor
Type:G Protein-Coupled Receptor (GPCR)
Mol. Mass.:42648.76
Organism:Homo sapiens (Human)
Description:P41145
Residue:380
BDBM50362539
NameBDBM50362539
Synonyms:CHEMBL1941030
TypeSmall organic molecule
Emp. Form.C23H30O8
Mol. Mass.434.4795
SMILESCOCO[C@H]1C[C@@H](C(=O)OC)[C@]2(C)CC[C@H]3C(=O)O[C@H](C[C@]3(C)[C@H]2C1=O)c1ccoc1