Reaction Details
TargetKappa-type opioid receptor
LigandBDBM50266337
Substrate/Competitorn/a
Meas. Tech.ChEMBL_797843 (CHEMBL1942429)
EC50 382±n/a nM
Citation Béguin, CPotuzak, JXu, WLiu-Chen, LYStreicher, JMGroer, CEBohn, LMCarlezon, WACohen, BM Differential signaling properties at the kappa opioid receptor of 12-epi-salvinorin A and its analogues. Bioorg Med Chem Lett22:1023-6 (2012) 
 
Kappa-type opioid receptor
Name:Kappa-type opioid receptor
Type:G Protein-Coupled Receptor (GPCR)
Mol. Mass.:42648.76
Organism:Homo sapiens (Human)
Description:P41145
Residue:380
BDBM50266337
NameBDBM50266337
Synonyms:12-epi-Salvinorin A | CHEMBL458235
TypeSmall organic molecule
Emp. Form.C23H28O8
Mol. Mass.432.4636
SMILESCOC(=O)[C@@H]1C[C@H](OC(C)=O)C(=O)[C@H]2[C@@]1(C)CC[C@H]1C(=O)O[C@H](C[C@]21C)c1ccoc1