Reaction Details
TargetNeuronal acetylcholine receptor subunit alpha-4/beta-2
LigandBDBM50110258
Substrate/Competitorn/a
Meas. Tech.ChEMBL_797631 (CHEMBL1943749)
Ki 0.04±n/a nM
Citation Dallanoce, CMatera, CPucci, LGotti, CClementi, FAmici, MDMicheli, CD Synthesis and binding affinity ata4ß2 anda7 nicotinic acetylcholine receptors of new analogs of epibatidine and epiboxidine containing the 7-azabicyclo[2.2.1]hept-2-ene ring system. Bioorg Med Chem Lett22:829-32 (2012) 
 
Neuronal acetylcholine receptor subunit alpha-4/beta-2
Name:Neuronal acetylcholine receptor subunit alpha-4/beta-2
Type:Protein
Mol. Mass.:n/a
Description:n/a
Components:This complex has 2 components.
Component 1
Name:Neuronal acetylcholine receptor subunit alpha-4
Synonyms:ACHA4_HUMAN CHRNA4 protein Neuronal acetylcholine receptor protein alpha-4 subunit Nicotinic acetylcholine receptor alpha4/beta2/alpha5
Type:n/a
Mol. Mass.:69963.49
Organism:Homo sapiens (Human)
Description:NACHRA4
Residue:627
Component 2
Name:Neuronal acetylcholine receptor subunit beta-2
Synonyms:ACHB2_HUMAN Neuronal acetylcholine receptor protein beta-2 subunit | Nicotinic acetylcholine receptor alpha3/beta2/alpha5
Type:Protein
Mol. Mass.:57020.50
Organism:Homo sapiens (Human)
Description:P17787
Residue:502
BDBM50110258
NameBDBM50110258
Synonyms:(6S)-2-(6-chloropyridin-3-yl)-9-azabicyclo[4.2.1]non-2-ene 2-(6-Chloro-pyridin-3-yl)-9-aza-bicyclo[4.2.1]non-2-ene(UB-165) | CHEMBL275466
TypeSmall organic molecule
Emp. Form.C13H15ClN2
Mol. Mass.234.725
SMILESClc1ccc(cn1)C1=CCC[C@H]2CCC1N2