Reaction Details
TargetcGMP-specific 3',5'-cyclic phosphodiesterase
LigandBDBM50362709
Substrate/Competitorn/a
Meas. Tech.ChEMBL_797636 (CHEMBL1943754)
Ki>100000±n/a nM
Citation Ho, GDYang, SWSmotryski, JBercovici, ANechuta, TSmith, EMMcElroy, WTan, ZTulshian, DMcKittrick, BGreenlee, WJHruza, AXiao, LRindgen, DMullins, DGuzzi, MZhang, XBleickardt, CHodgson, R The discovery of potent, selective, and orally active pyrazoloquinolines as PDE10A inhibitors for the treatment of Schizophrenia. Bioorg Med Chem Lett22:1019-22 (2012) 
 
cGMP-specific 3',5'-cyclic phosphodiesterase
Name:cGMP-specific 3',5'-cyclic phosphodiesterase
Type:Protein
Mol. Mass.:99975.83
Organism:Homo sapiens (Human)
Description:O76074
Residue:875
BDBM50362709
NameBDBM50362709
Synonyms:CHEMBL1939782
TypeSmall organic molecule
Emp. Form.C17H21N5O
Mol. Mass.311.3815
SMILESCOc1cc(C)c2nc3[nH]nc(C)c3c(N3CCNCC3)c2c1