Reaction Details
TargetCasein kinase I isoform delta
LigandBDBM50362709
Substrate/Competitorn/a
Meas. Tech.ChEMBL_798419 (CHEMBL1944167)
IC50 320±n/a nM
Citation Ho, GDYang, SWSmotryski, JBercovici, ANechuta, TSmith, EMMcElroy, WTan, ZTulshian, DMcKittrick, BGreenlee, WJHruza, AXiao, LRindgen, DMullins, DGuzzi, MZhang, XBleickardt, CHodgson, R The discovery of potent, selective, and orally active pyrazoloquinolines as PDE10A inhibitors for the treatment of Schizophrenia. Bioorg Med Chem Lett22:1019-22 (2012) 
 
Casein kinase I isoform delta
Name:Casein kinase I isoform delta
Type:Enzyme
Mol. Mass.:47356.76
Organism:Homo sapiens (Human)
Description:P48730
Residue:415
BDBM50362709
NameBDBM50362709
Synonyms:CHEMBL1939782
TypeSmall organic molecule
Emp. Form.C17H21N5O
Mol. Mass.311.3815
SMILESCOc1cc(C)c2nc3[nH]nc(C)c3c(N3CCNCC3)c2c1