Reaction Details
TargetTransient receptor potential cation channel subfamily A member 1
LigandBDBM50318463
Substrate/Competitorn/a
Meas. Tech.ChEMBL_798424 (CHEMBL1944172)
IC50>10000±n/a nM
Citation Gijsen, HJBerthelot, DDe Cleyn, MAGeuens, IBrône, BMercken, M Tricyclic 3,4-dihydropyrimidine-2-thione derivatives as potent TRPA1 antagonists. Bioorg Med Chem Lett22:797-800 (2012) 
 
Transient receptor potential cation channel subfamily A member 1
Name:Transient receptor potential cation channel subfamily A member 1
Type:Protein
Mol. Mass.:127514.20
Organism:Homo sapiens (Human)
Description:O75762
Residue:1119
BDBM50318463
NameBDBM50318463
Synonyms:2-(1,3-dimethyl-2,6-dioxo-2,3-dihydro-1H-purin-7(6H)-yl)-N-(4-isopropylphenyl)acetamide | CHEMBL1086310
TypeSmall organic molecule
Emp. Form.C18H21N5O3
Mol. Mass.355.391
SMILESCC(C)c1ccc(NC(=O)Cn2cnc3n(C)c(=O)n(C)c(=O)c23)cc1