Reaction Details
TargetTransient receptor potential cation channel subfamily A member 1
LigandBDBM50362753
Substrate/Competitorn/a
Meas. Tech.ChEMBL_798425 (CHEMBL1944173)
IC50 20±n/a nM
Citation Gijsen, HJBerthelot, DDe Cleyn, MAGeuens, IBrône, BMercken, M Tricyclic 3,4-dihydropyrimidine-2-thione derivatives as potent TRPA1 antagonists. Bioorg Med Chem Lett22:797-800 (2012) 
 
Transient receptor potential cation channel subfamily A member 1
Name:Transient receptor potential cation channel subfamily A member 1
Type:PROTEIN
Mol. Mass.:128622.74
Organism:Rattus norvegicus
Description:ChEMBL_1450487
Residue:1125
BDBM50362753
NameBDBM50362753
Synonyms:CHEMBL1939978
TypeSmall organic molecule
Emp. Form.C18H14N2O2S
Mol. Mass.322.381
SMILESCOc1cccc(c1)C1NC(=S)N=C2C1C(=O)c1ccccc21