Reaction Details
TargetTransient receptor potential cation channel subfamily V member 1
LigandBDBM50362800
Substrate/Competitorn/a
Meas. Tech.ChEMBL_798527 (CHEMBL1942324)
Ki 8±n/a nM
Citation Sun, WLiu, KRyu, HKang, DWKim, YSKim, MSCho, YBhondwe, RSThorat, SAKim, HSPearce, LVPavlyukovets, VATran, RMorgan, MALazar, JRyder, CBToth, ABlumberg, PMLee, J 2-(4-Methylsulfonylaminophenyl) propanamide TRPV1 antagonists: Structure-activity relationships in the B and C-regions. Bioorg Med Chem20:1310-8 (2012) 
 
Transient receptor potential cation channel subfamily V member 1
Name:Transient receptor potential cation channel subfamily V member 1
Type:Transient Receptor
Mol. Mass.:94956.12
Organism:Rattus norvegicus (rat)
Description:O35433
Residue:838
BDBM50362800
NameBDBM50362800
Synonyms:CHEMBL1940382
TypeSmall organic molecule
Emp. Form.C27H29FN2O3S
Mol. Mass.480.594
SMILES[#6]-[#6](-[#6](=O)-[#7]-[#6]\[#6]=[#6](\c1ccc(-[#6])cc1)-c1ccc(-[#6])cc1)-c1ccc(-[#7]S([#6])(=O)=O)c(F)c1