Reaction Details
TargetAldo-keto reductase family 1 member B10
LigandBDBM50327036
Substrate/Competitorn/a
Meas. Tech.ChEMBL_798534 (CHEMBL1942331)
IC50 7900±n/a nM
Citation Soda, MHu, DEndo, STakemura, MLi, JWada, RIfuku, SZhao, HTEl-Kabbani, OOhta, SYamamura, KToyooka, NHara, AMatsunaga, T Design, synthesis and evaluation of caffeic acid phenethyl ester-based inhibitors targeting a selectivity pocket in the active site of human aldo-keto reductase 1B10. Eur J Med Chem48:321-9 (2012) 
 
Aldo-keto reductase family 1 member B10
Name:Aldo-keto reductase family 1 member B10
Type:Protein
Mol. Mass.:36024.67
Organism:Homo sapiens (Human)
Description:O60218. 1ZUA; 4JII; 4GQ0
Residue:316
BDBM50327036
NameBDBM50327036
Synonyms:(1R,3S,4S,5S)-3-[(E)-3-(3,4-Dihydroxy-phenyl)-acryloyloxy]-1,4,5-trihydroxy-cyclohexanecarboxylic acid (1S,3R,4R,5R,E)-3-(3-(3,4-dihydroxyphenyl)acryloyloxy)-1,4,5-trihydroxycyclohexanecarboxylic acid 3-[3-(3,4-Dihydroxy-phenyl)-acryloyloxy]-1,4,5-trihydroxy-cyclohexanecarboxylic acid 5-caffeoyl quinic acid Caffeoylquinic acid Chlorogenicacid US11866416, Example 10 | chlorogenic acid
TypeSmall organic molecule
Emp. Form.C16H18O9
Mol. Mass.354.3087
SMILESO[C@@H]1C[C@](O)(C[C@@H](OC(=O)\C=C\c2ccc(O)c(O)c2)[C@@H]1O)C(O)=O