Reaction Details
TargetAldo-keto reductase family 1 member B1
LigandBDBM50029198
Substrate/Competitorn/a
Meas. Tech.ChEMBL_798533 (CHEMBL1942330)
IC50 400±n/a nM
Citation Soda, MHu, DEndo, STakemura, MLi, JWada, RIfuku, SZhao, HTEl-Kabbani, OOhta, SYamamura, KToyooka, NHara, AMatsunaga, T Design, synthesis and evaluation of caffeic acid phenethyl ester-based inhibitors targeting a selectivity pocket in the active site of human aldo-keto reductase 1B10. Eur J Med Chem48:321-9 (2012) 
 
Aldo-keto reductase family 1 member B1
Name:Aldo-keto reductase family 1 member B1
Type:Protein
Mol. Mass.:35855.50
Organism:Homo sapiens (Human)
Description:P15121. 4LAU; 2IKI; 4LB4; 2FZD; 2FZ8; 1US0
Residue:316
BDBM50029198
NameBDBM50029198
Synonyms:(E)-3-(3,4-Dihydroxy-phenyl)-acrylic acid benzyl ester 3-(3,4-Dihydroxy-phenyl)-acrylic acid benzyl ester Phenylmethyl 1-(3',4'-dihydroxyphenyl)propenate benzyl caffeate
TypeSmall organic molecule
Emp. Form.C16H14O4
Mol. Mass.270.28
SMILESOc1ccc(\C=C\C(=O)OCc2ccccc2)cc1O