Reaction Details
Target5-hydroxytryptamine receptor 1A
LigandBDBM50362863
Substrate/Competitorn/a
Meas. Tech.ChEMBL_797754 (CHEMBL1944113)
Ki 1.1±n/a nM
Citation Peprah, KZhu, XYEyunni, SVSetola, VRoth, BLAblordeppey, SY Multi-receptor drug design: Haloperidol as a scaffold for the design and synthesis of atypical antipsychotic agents. Bioorg Med Chem20:1291-7 (2012) 
 
5-hydroxytryptamine receptor 1A
Name:5-hydroxytryptamine receptor 1A
Type:n/a
Mol. Mass.:46122.49
Organism:Homo sapiens (Human)
Description:n/a
Residue:422
BDBM50362863
NameBDBM50362863
Synonyms:CHEMBL1940418
TypeSmall organic molecule
Emp. Form.C19H24FN3
Mol. Mass.313.4124
SMILESFc1ccc(CCCCN2CCN(CC2)c2ccccn2)cc1