Reaction Details
TargetVasopressin V1a receptor
LigandBDBM50362871
Substrate/Competitorn/a
Meas. Tech.ChEMBL_798001 (CHEMBL1942977)
Ki 0.63±n/a nM
Citation Fabio, KGuillon, CLacey, CJLu, SFHeindel, NDFerris, CFPlaczek, MJones, GBrownstein, MJSimon, NG Synthesis and evaluation of potent and selective human V1a receptor antagonists as potential ligands for PET or SPECT imaging. Bioorg Med Chem20:1337-45 (2012) 
 
Vasopressin V1a receptor
Name:Vasopressin V1a receptor
Type:Receptor
Mol. Mass.:46820.18
Organism:Homo sapiens (Human)
Description:P37288
Residue:418
BDBM50362871
NameBDBM50362871
Synonyms:CHEMBL1940588
TypeSmall organic molecule
Emp. Form.C43H51N5O5
Mol. Mass.717.8955
SMILESC[C@@H](NC(=O)[C@@H](CC(=O)N1CCC(CC1)N1CCCCC1)N1[C@H](\C=C\c2cccc(C)c2)[C@H](N2[C@H](COC2=O)c2ccccc2)C1=O)c1ccccc1